Target
Indolethylamine N-methyltransferase
Ligand
BDBM50000115
Substrate
Meas. Tech.
ChEMBL_1333668 (CHEMBL3231054)
IC50
2600±n/a nM
Citation
 Rokach, JHamel, PHunter, NRReader, GRooney, CSAnderson, PSCragoe, EJMandel, LR Cyclic amidine inhibitors of indolamine N-methyltransferase. J Med Chem 22:237-47 (1979)  
Target
Name:
Indolethylamine N-methyltransferase
Synonyms:
Amine N-methyltransferase Arylamine N-methyltransferase INMT_HUMAN | Indolamine N-methyltransferase
Type:
PROTEIN
Mol. Mass.:
28884.19
Organism:
Homo sapiens (Human)
Description:
ChEMBL_1333668
Residue:
263
  
Inhibitor
Name:
BDBM50000115
Synonyms:
CHEMBL3228354
Type:
Small organic molecule
Emp. Form.:
C9H14N2O4S
Mol. Mass.:
246.283
SMILES:
CCN1CCSC1=N.OC(=O)\C=C\C(O)=O
: