Target
Cathepsin B
Ligand
BDBM50320734
Substrate
Meas. Tech.
ChEMBL_1337273 (CHEMBL3240887)
Ki
1900±n/a nM
Citation
 Raghav, NSingh, M Acyl hydrazides and triazoles as novel inhibitors of mammalian cathepsin B and cathepsin H. Eur J Med Chem 77:231-42 (2014)  
Target
Name:
Cathepsin B
Synonyms:
Type:
Protein
Mol. Mass.:
36777.57
Organism:
Capra hircus (Goat)
Description:
Residue:
335
  
Inhibitor
Name:
BDBM50320734
Synonyms:
4-Hydroxy-benzoic acid hydrazide CHEMBL124267
Type:
Small organic molecule
Emp. Form.:
C7H8N2O2
Mol. Mass.:
152.1506
SMILES:
NNC(=O)c1ccc(O)cc1
: