Target
Cathepsin B
Ligand
BDBM50001684
Substrate
Meas. Tech.
ChEMBL_1337274 (CHEMBL3240888)
Ki
120000±n/a nM
Citation
 Raghav, NSingh, M Acyl hydrazides and triazoles as novel inhibitors of mammalian cathepsin B and cathepsin H. Eur J Med Chem 77:231-42 (2014)  
Target
Name:
Cathepsin B
Synonyms:
Type:
Protein
Mol. Mass.:
36777.57
Organism:
Capra hircus (Goat)
Description:
Residue:
335
  
Inhibitor
Name:
BDBM50001684
Synonyms:
CHEMBL1531266
Type:
Small organic molecule
Emp. Form.:
C14H12N4
Mol. Mass.:
236.2719
SMILES:
Nn1c(nnc1-c1ccccc1)-c1ccccc1
: