Target
Serine/threonine-protein kinase Nek1
Ligand
BDBM50001733
Substrate
Meas. Tech.
ChEMBL_1337318 (CHEMBL3241180)
IC50
>10000±n/a nM
Citation
 Mahmoud, KAKrug, MWersig, TSlynko, ISchächtele, CTotzke, FSippl, WHilgeroth, A Discovery of 4-anilinoa-carbolines as novel Brk inhibitors. Bioorg Med Chem Lett 24:1948-51 (2014)  
Target
Name:
Serine/threonine-protein kinase Nek1
Synonyms:
KIAA1901 NEK1 Never in mitosis A-related kinase 1 Renal carcinoma antigen NY-REN-55
Type:
Protein
Mol. Mass.:
142810.07
Organism:
Homo sapiens (Human)
Description:
Residue:
1258
  
Inhibitor
Name:
BDBM50001733
Synonyms:
CHEMBL3133821
Type:
Small organic molecule
Emp. Form.:
C17H13N3O
Mol. Mass.:
275.3046
SMILES:
Oc1cccc(Nc2ccnc3[nH]c4ccccc4c23)c1
: