Target
RAC-gamma serine/threonine-protein kinase
Ligand
BDBM50001733
Substrate
Meas. Tech.
ChEMBL_1337327 (CHEMBL3241189)
IC50
>10000±n/a nM
Citation
 Mahmoud, KAKrug, MWersig, TSlynko, ISchächtele, CTotzke, FSippl, WHilgeroth, A Discovery of 4-anilinoa-carbolines as novel Brk inhibitors. Bioorg Med Chem Lett 24:1948-51 (2014)  
Target
Name:
RAC-gamma serine/threonine-protein kinase
Synonyms:
AKT3 PKB gamma Protein kinase Akt-3 Protein kinase B, gamma RAC-gamma serine/threonine-protein kinase Serine/threonine-protein kinase AKT | Serine/threonine-protein kinase AKT3
Type:
Enzyme
Mol. Mass.:
55769.36
Organism:
Homo sapiens (Human)
Description:
Residue:
479
  
Inhibitor
Name:
BDBM50001733
Synonyms:
CHEMBL3133821
Type:
Small organic molecule
Emp. Form.:
C17H13N3O
Mol. Mass.:
275.3046
SMILES:
Oc1cccc(Nc2ccnc3[nH]c4ccccc4c23)c1
: