Target
Serine/threonine-protein kinase 26
Ligand
BDBM50001733
Substrate
Meas. Tech.
ChEMBL_1337678 (CHEMBL3242866)
IC50
>10000±n/a nM
Citation
 Mahmoud, KAKrug, MWersig, TSlynko, ISchächtele, CTotzke, FSippl, WHilgeroth, A Discovery of 4-anilinoa-carbolines as novel Brk inhibitors. Bioorg Med Chem Lett 24:1948-51 (2014)  
Target
Name:
Serine/threonine-protein kinase 26
Synonyms:
MASK STK26 Serine/threonine-protein kinase MST4
Type:
PROTEIN
Mol. Mass.:
46517.68
Organism:
Homo sapiens (Human)
Description:
ChEMBL_1510631
Residue:
416
  
Inhibitor
Name:
BDBM50001733
Synonyms:
CHEMBL3133821
Type:
Small organic molecule
Emp. Form.:
C17H13N3O
Mol. Mass.:
275.3046
SMILES:
Oc1cccc(Nc2ccnc3[nH]c4ccccc4c23)c1
: