Target
Homeodomain-interacting protein kinase 2
Ligand
BDBM50001733
Substrate
Meas. Tech.
ChEMBL_1337687 (CHEMBL3242875)
IC50
>10000±n/a nM
Citation
 Mahmoud, KAKrug, MWersig, TSlynko, ISchächtele, CTotzke, FSippl, WHilgeroth, A Discovery of 4-anilinoa-carbolines as novel Brk inhibitors. Bioorg Med Chem Lett 24:1948-51 (2014)  
Target
Name:
Homeodomain-interacting protein kinase 2
Synonyms:
HIPK2 Homeodomain-interacting protein kinase 2 | Homeodomain-interacting protein kinase 2 (HIPK2)
Type:
Protein
Mol. Mass.:
131001.90
Organism:
Homo sapiens (Human)
Description:
Q9H2X6
Residue:
1198
  
Inhibitor
Name:
BDBM50001733
Synonyms:
CHEMBL3133821
Type:
Small organic molecule
Emp. Form.:
C17H13N3O
Mol. Mass.:
275.3046
SMILES:
Oc1cccc(Nc2ccnc3[nH]c4ccccc4c23)c1
: