Target
Protein-tyrosine kinase 6
Ligand
BDBM50001739
Substrate
Meas. Tech.
ChEMBL_1337320 (CHEMBL3241182)
IC50
59±n/a nM
Citation
 Mahmoud, KAKrug, MWersig, TSlynko, ISchächtele, CTotzke, FSippl, WHilgeroth, A Discovery of 4-anilinoa-carbolines as novel Brk inhibitors. Bioorg Med Chem Lett 24:1948-51 (2014)  
Target
Name:
Protein-tyrosine kinase 6
Synonyms:
BRK KH domain-containing, RNA-binding, signal transduction-associated protein 1 PTK6_HUMAN Tyrosine Kinase BRK Tyrosine-protein kinase BRK
Type:
Tyrosine-protein kinase
Mol. Mass.:
51839.11
Organism:
Homo sapiens (Human)
Description:
Residue:
451
  
Inhibitor
Name:
BDBM50001739
Synonyms:
CHEMBL3238092
Type:
Small organic molecule
Emp. Form.:
C18H12F3N3
Mol. Mass.:
327.3032
SMILES:
FC(F)(F)c1cccc(Nc2ccnc3[nH]c4ccccc4c23)c1
: