Target
Amyloid-beta precursor protein
Ligand
BDBM50398211
Substrate
Meas. Tech.
ChEMBL_1339390 (CHEMBL3243724)
Ki
24±n/a nM
Citation
 Nabuurs, RJKapoerchan, VVMetaxas, Ade Jongh, Sde Backer, MWelling, MMJiskoot, WWindhorst, ADOverkleeft, HSvan Buchem, MAOverhand, Mvan der Weerd, L Polyfluorinated bis-styrylbenzenes as amyloid-ß plaque binding ligands. Bioorg Med Chem 22:2469-81 (2014)  
Target
Name:
Amyloid-beta precursor protein
Synonyms:
A4 ABPP AICD-50 AICD-59 AID(57) APP Alzheimer disease amyloid protein Amyloid beta Protein Amyloid beta protein Abeta(1-42) Amyloid intracellular domain 57 Amyloid protein (Abeta42b) Beta amyloid A4 protein Beta-APP42 Beta-amyloid protein 42 C83 CVAP Gamma Secretase Gamma-CTF(57) Gamma-secretase Gamma-secretase C-terminal fragment 57 P3(40) PN-II Protease nexin-II S-APP-beta Soluble APP-beta | beta-Amyloid Precursor Protein (APP)
Type:
Single-pass type I membrane protein
Mol. Mass.:
86890.41
Organism:
Homo sapiens (Human)
Description:
P05067
Residue:
770
  
Inhibitor
Name:
BDBM50398211
Synonyms:
CHEMBL2181036
Type:
Small organic molecule
Emp. Form.:
C23H20O3
Mol. Mass.:
344.4031
SMILES:
COc1cc(\C=C\c2ccc(O)cc2)ccc1\C=C\c1ccc(O)cc1
: