Target
Dipeptidyl peptidase 8
Ligand
BDBM50003020
Substrate
Meas. Tech.
ChEMBL_1335102 (CHEMBL3239609)
IC50
>67000±n/a nM
Citation
 Biftu, TSinha-Roy, RChen, PQian, XFeng, DKuethe, JTScapin, GGao, YDYan, YKrueger, DBak, AEiermann, GHe, JCox, JHicks, JLyons, KHe, HSalituro, GTong, SPatel, SDoss, GPetrov, AWu, JXu, SSSewall, CZhang, XZhang, BThornberry, NAWeber, AE Omarigliptin (MK-3102): a novel long-acting DPP-4 inhibitor for once-weekly treatment of type 2 diabetes. J Med Chem 57:3205-12 (2014)  
Target
Name:
Dipeptidyl peptidase 8
Synonyms:
DPP8 DPRP-1 Dipeptidyl peptidase 8 (DPP-8) Dipeptidyl peptidase 8/9 Dipeptidyl peptidase VIII Prolyl dipeptidase DPP8
Type:
Enzyme
Mol. Mass.:
103342.62
Organism:
Homo sapiens (Human)
Description:
Q6V1X1
Residue:
898
  
Inhibitor
Name:
BDBM50003020
Synonyms:
MK-3102 US10155775, Omarigliptin US10822319, Compound Omarigliptin
Type:
Small organic molecule
Emp. Form.:
C17H20F2N4O3S
Mol. Mass.:
398.428
SMILES:
CS(=O)(=O)n1cc2CN(Cc2n1)[C@H]1CO[C@@H]([C@@H](N)C1)c1cc(F)ccc1F
: