Target
D(3) dopamine receptor
Ligand
BDBM50003072
Substrate
Meas. Tech.
ChEMBL_1335161 (CHEMBL3239710)
Ki
21000±n/a nM
Citation
 Xiao, JFree, RBBarnaeva, EConroy, JLDoyle, TMiller, BBryant-Genevier, MTaylor, MKHu, XDulcey, AESouthall, NFerrer, MTitus, SZheng, WSibley, DRMarugan, JJ Discovery, optimization, and characterization of novel D2 dopamine receptor selective antagonists. J Med Chem 57:3450-63 (2014)  
Target
Name:
D(3) dopamine receptor
Synonyms:
DOPAMINE D3 DRD3_HUMAN Dopamine D3 receptor (D3) Dopamine receptor Dopamine receptor D3
Type:
Mol. Mass.:
44243.43
Organism:
Homo sapiens (Human)
Description:
Residue:
400
  
Inhibitor
Name:
BDBM50003072
Synonyms:
CHEMBL3234542
Type:
Small organic molecule
Emp. Form.:
C21H17N3O3S
Mol. Mass.:
391.443
SMILES:
CN1c2cc(ccc2[S@@+]([O-])c2ccccc2C1=O)C(=O)NCc1cccnc1
: