Target
G-protein coupled bile acid receptor 1
Ligand
BDBM50003407
Substrate
Meas. Tech.
ChEMBL_1335566 (CHEMBL3239421)
EC50
1.000000±n/a nM
Citation
 Phillips, DPGao, WYang, YZhang, GLerario, IKLau, TLJiang, JWang, XNguyen, DGBhat, BGTrotter, CSullivan, HWelzel, GLandry, JChen, YJoseph, SBLi, CGordon, WPRichmond, WJohnson, KBretz, ABursulaya, BPan, SMcNamara, PSeidel, HM Discovery of trifluoromethyl(pyrimidin-2-yl)azetidine-2-carboxamides as potent, orally bioavailable TGR5 (GPBAR1) agonists: structure-activity relationships, lead optimization, and chronic in vivo efficacy. J Med Chem 57:3263-82 (2014)  
Target
Name:
G-protein coupled bile acid receptor 1
Synonyms:
GPBAR_MOUSE M-BAR Tgr5
Type:
PROTEIN
Mol. Mass.:
35665.78
Organism:
Mus musculus
Description:
ChEMBL_1475560
Residue:
329
  
Inhibitor
Name:
BDBM50003407
Synonyms:
CHEMBL3234568
Type:
Small organic molecule
Emp. Form.:
C25H30F3N7O
Mol. Mass.:
501.5472
SMILES:
CN1CCN(CC1)c1cc(nc(n1)C(F)(F)F)N1CCC[C@H](C1)C(=O)NCCc1ccc(cc1)C#N
: