Target
Transcriptional regulator ERG
Ligand
BDBM50003334
Substrate
Meas. Tech.
ChEMBL_1335569 (CHEMBL3239424)
IC50
3100±n/a nM
Citation
 Phillips, DPGao, WYang, YZhang, GLerario, IKLau, TLJiang, JWang, XNguyen, DGBhat, BGTrotter, CSullivan, HWelzel, GLandry, JChen, YJoseph, SBLi, CGordon, WPRichmond, WJohnson, KBretz, ABursulaya, BPan, SMcNamara, PSeidel, HM Discovery of trifluoromethyl(pyrimidin-2-yl)azetidine-2-carboxamides as potent, orally bioavailable TGR5 (GPBAR1) agonists: structure-activity relationships, lead optimization, and chronic in vivo efficacy. J Med Chem 57:3263-82 (2014)  
Target
Name:
Transcriptional regulator ERG
Synonyms:
ERG Transforming protein ERG
Type:
PROTEIN
Mol. Mass.:
54615.84
Organism:
Homo sapiens (Human)
Description:
ChEMBL_1335569
Residue:
486
  
Inhibitor
Name:
BDBM50003334
Synonyms:
CHEMBL3234564
Type:
Small organic molecule
Emp. Form.:
C25H33N7O
Mol. Mass.:
447.5758
SMILES:
CN1CCN(CC1)c1cc(C)nc(n1)N1CCC[C@H](C1)C(=O)NCCc1ccc(cc1)C#N
: