Target
G-protein coupled bile acid receptor 1
Ligand
BDBM50003568
Substrate
Meas. Tech.
ChEMBL_1335566 (CHEMBL3239421)
EC50
2.0±n/a nM
Citation
 Phillips, DPGao, WYang, YZhang, GLerario, IKLau, TLJiang, JWang, XNguyen, DGBhat, BGTrotter, CSullivan, HWelzel, GLandry, JChen, YJoseph, SBLi, CGordon, WPRichmond, WJohnson, KBretz, ABursulaya, BPan, SMcNamara, PSeidel, HM Discovery of trifluoromethyl(pyrimidin-2-yl)azetidine-2-carboxamides as potent, orally bioavailable TGR5 (GPBAR1) agonists: structure-activity relationships, lead optimization, and chronic in vivo efficacy. J Med Chem 57:3263-82 (2014)  
Target
Name:
G-protein coupled bile acid receptor 1
Synonyms:
GPBAR_MOUSE M-BAR Tgr5
Type:
PROTEIN
Mol. Mass.:
35665.78
Organism:
Mus musculus
Description:
ChEMBL_1475560
Residue:
329
  
Inhibitor
Name:
BDBM50003568
Synonyms:
CHEMBL3234583
Type:
Small organic molecule
Emp. Form.:
C31H31F3N6O4
Mol. Mass.:
608.6108
SMILES:
OC(=O)Cc1ccc(OC2CCN(CC2)c2cc(nc(n2)C(F)(F)F)N2CC[C@H]2C(=O)NCCc2ccc(cc2)C#N)cc1
: