Target
Adenosine receptor A1
Ligand
BDBM50003647
Substrate
Meas. Tech.
ChEMBL_1336084 (CHEMBL3240795)
EC50
1.000000±n/a nM
Citation
 Louvel, JGuo, DAgliardi, MMocking, TAKars, RPham, TPXia, Lde Vries, HBrussee, JHeitman, LHIjzerman, AP Agonists for the adenosine A1 receptor with tunable residence time. A Case for nonribose 4-amino-6-aryl-5-cyano-2-thiopyrimidines. J Med Chem 57:3213-22 (2014)  
Target
Name:
Adenosine receptor A1
Synonyms:
A1 adenosine receptor (hA1) AA1R_HUMAN ADORA1 Adenosine A1-receptor Adenosine receptor A1 (hA1) | Adenosine transporter (AdT)
Type:
G Protein-Coupled Receptor (GPCR)
Mol. Mass.:
36520.92
Organism:
Homo sapiens (Human)
Description:
P30542
Residue:
326
  
Inhibitor
Name:
BDBM50003647
Synonyms:
CHEMBL3235280
Type:
Small organic molecule
Emp. Form.:
C32H41N9O2S
Mol. Mass.:
615.792
SMILES:
CCN(CC)CCN1CCN(CC1)C(=O)CCc1cccc(CSc2nc(N)c(C#N)c(n2)-c2ccc(NC(C)=O)cc2)n1
: