Target
Adenosine receptor A1
Ligand
BDBM50003699
Substrate
Meas. Tech.
ChEMBL_1336093 (CHEMBL3240804)
EC50
1.9±n/a nM
Citation
 Louvel, JGuo, DAgliardi, MMocking, TAKars, RPham, TPXia, Lde Vries, HBrussee, JHeitman, LHIjzerman, AP Agonists for the adenosine A1 receptor with tunable residence time. A Case for nonribose 4-amino-6-aryl-5-cyano-2-thiopyrimidines. J Med Chem 57:3213-22 (2014)  
Target
Name:
Adenosine receptor A1
Synonyms:
A1 adenosine receptor (hA1) AA1R_HUMAN ADORA1 Adenosine A1-receptor Adenosine receptor A1 (hA1) | Adenosine transporter (AdT)
Type:
G Protein-Coupled Receptor (GPCR)
Mol. Mass.:
36520.92
Organism:
Homo sapiens (Human)
Description:
P30542
Residue:
326
  
Inhibitor
Name:
BDBM50003699
Synonyms:
CHEMBL3234952
Type:
Small organic molecule
Emp. Form.:
C23H17N5O3S2
Mol. Mass.:
475.543
SMILES:
COc1ccc(cc1)-c1nc(CSc2nc(N)c(C#N)c(n2)-c2ccc3OCOc3c2)cs1
: