Target
Diacylglycerol O-acyltransferase 1
Ligand
BDBM50003713
Substrate
Meas. Tech.
ChEMBL_1336096 (CHEMBL3240807)
IC50
13±n/a nM
Citation
 Fox, BMSugimoto, KIio, KYoshida, AZhang, JKLi, KHao, XLabelle, MSmith, MLRubenstein, SMYe, GMcMinn, DJackson, SChoi, RShan, BMa, JMiao, SMatsui, TOgawa, NSuzuki, MKobayashi, AOzeki, HOkuma, CIshii, YTomimoto, DFurakawa, NTanaka, MMatsushita, MTakahashi, MInaba, TSagawa, SKayser, F Discovery of 6-phenylpyrimido[4,5-b][1,4]oxazines as potent and selective acyl CoA:diacylglycerol acyltransferase 1 (DGAT1) inhibitors with in vivo efficacy in rodents. J Med Chem 57:3464-83 (2014)  
Target
Name:
Diacylglycerol O-acyltransferase 1
Synonyms:
ACAT-related gene product 1 Acyl coA-diacylglycerol acyl transferase 1 (DGAT1) DGAT1 Diacylglycerol Acyltransferase (DGAT1) Diacylglycerol O-acyltransferase 1 (DGAT1) | Diglyceride acyltransferase
Type:
Protein
Mol. Mass.:
55297.82
Organism:
Homo sapiens (Human)
Description:
O75907
Residue:
488
  
Inhibitor
Name:
BDBM50003713
Synonyms:
CHEMBL3235323
Type:
Small organic molecule
Emp. Form.:
C25H29N3O3
Mol. Mass.:
419.5161
SMILES:
CC1(C)Oc2ncnc(N)c2C=C1c1ccc2c(CC[C@@]22CC[C@H](CC(O)=O)CC2)c1
: