Target
Heat shock protein HSP 90-beta
Ligand
BDBM50003892
Substrate
Meas. Tech.
ChEMBL_1336949 (CHEMBL3242257)
Ki
25±n/a nM
Citation
 Ernst, JTNeubert, TLiu, MSperry, SZuccola, HTurnbull, AFleck, BKargo, WWoody, LChiang, PTran, DChen, WSnyder, PAlcacio, TNezami, AReynolds, JAlvi, KGoulet, LStamos, D Identification of novel HSP90a/ß isoform selective inhibitors using structure-based drug design. demonstration of potential utility in treating CNS disorders such as Huntington's disease. J Med Chem 57:3382-400 (2014)  
Target
Name:
Heat shock protein HSP 90-beta
Synonyms:
HS90B_HUMAN HSP 90 HSP90B HSPCB Heat shock protein HSP 90 (Hsp90)
Type:
Molecular Chaperone
Mol. Mass.:
83229.45
Organism:
Homo sapiens (Human)
Description:
P08238
Residue:
724
  
Inhibitor
Name:
BDBM50003892
Synonyms:
CHEMBL3235343
Type:
Small organic molecule
Emp. Form.:
C24H32N4O2
Mol. Mass.:
408.5365
SMILES:
CC(C)Nc1cc(ccc1C(N)=O)-n1c2CN(C)CCc2c2c1CC(C)(C)CC2=O
: