Target
Bifunctional epoxide hydrolase 2
Ligand
BDBM4078
Substrate
Meas. Tech.
ChEMBL_1339041 (CHEMBL3243099)
IC50
20700±n/a nM
Citation
 Luyen, BTTai, BHThao, NPEun, KJCha, JYXin, MJLee, YMKim, YH Anti-inflammatory components of Euphorbia humifusa Willd. Bioorg Med Chem Lett 24:1895-900 (2014)  
Target
Name:
Bifunctional epoxide hydrolase 2
Synonyms:
Cytosolic epoxide hydrolase 2 EPHX2 HYES_HUMAN Soluble epoxide hydrolase (sEH) | epoxide hydrolase 2, cytoplasmic
Type:
Enzyme
Mol. Mass.:
62613.07
Organism:
Homo sapiens (Human)
Description:
P34913
Residue:
555
  
Inhibitor
Name:
BDBM4078
Synonyms:
6,7,13,14-tetrahydroxy-2,9-dioxatetracyclo[6.6.2.0^{4,16}.0^{11,15}]hexadeca-1(14),4(16),5,7,11(15),12-hexaene-3,10-dione ELLAGIC ACID Ellagic acid (18) MLS000069632 cid_5281855
Type:
Small organic molecule
Emp. Form.:
C14H6O8
Mol. Mass.:
302.1926
SMILES:
Oc1cc2c3c(oc(=O)c4cc(O)c(O)c(oc2=O)c34)c1O
: