Target
Aurora kinase A
Ligand
BDBM31093
Substrate
Meas. Tech.
ChEMBL_1339462 (CHEMBL3243855)
IC50
4.0±n/a nM
Citation
 Luo, YDeng, YQWang, JLong, ZJTu, ZCPeng, WZhang, JQLiu, QLu, G Design, synthesis and bioevaluation of N-trisubstituted pyrimidine derivatives as potent aurora A kinase inhibitors. Eur J Med Chem 78:65-71 (2014)  
Target
Name:
Aurora kinase A
Synonyms:
AURKA_MOUSE Airk1 Aura Aurora Kinase A (Aurora-A) Aurora-family kinase 1 Ayk1 Iak1 Serine/threonine-protein kinase Aurora-A Stk15 | Stk6
Type:
Enzyme
Mol. Mass.:
44791.66
Organism:
Mus musculus (mouse)
Description:
Residue:
395
  
Inhibitor
Name:
BDBM31093
Synonyms:
4-[[7-[2,6-bis(fluoranyl)phenyl]-9-chloranyl-5H-pyrimido[5,4-d][2]benzazepin-2-yl]amino]benzoic acid BDBM31832 MLN-8054 | cid_11712649
Type:
Small organic molecule
Emp. Form.:
C25H15ClF2N4O2
Mol. Mass.:
476.862
SMILES:
OC(=O)c1ccc(Nc2ncc3CN=C(c4cc(Cl)ccc4-c3n2)c2c(F)cccc2F)cc1
: