Target
Insulin-degrading enzyme
Ligand
BDBM50005640
Substrate
Meas. Tech.
ChEMBL_1339900 (CHEMBL3243737)
IC50
600±n/a nM
Citation
 Charton, JGauriot, MGuo, QHennuyer, NMarechal, XDumont, JHamdane, MPottiez, VLandry, VSperandio, OFlipo, MBuee, LStaels, BLeroux, FTang, WJDeprez, BDeprez-Poulain, R Imidazole-derived 2-[N-carbamoylmethyl-alkylamino]acetic acids, substrate-dependent modulators of insulin-degrading enzyme in amyloid-ß hydrolysis. Eur J Med Chem 79:184-93 (2014)  
Target
Name:
Insulin-degrading enzyme
Synonyms:
Abeta-degrading protease IDE Insulin degrading enzyme (hIDE) Insulin-degrading enzyme Insulysin | insulin-degrading enzyme isoform 1 precursor
Type:
Enzyme Catalytic Domain
Mol. Mass.:
117968.59
Organism:
Homo sapiens (Human)
Description:
P14735
Residue:
1019
  
Inhibitor
Name:
BDBM50005640
Synonyms:
CHEMBL3235415
Type:
Small organic molecule
Emp. Form.:
C18H23N5O4
Mol. Mass.:
373.4063
SMILES:
CNC(=O)[C@H](Cc1c[nH]cn1)NC(=O)CN(CC(O)=O)Cc1ccccc1
: