Target
Cannabinoid receptor 1
Ligand
BDBM50006257
Substrate
Meas. Tech.
ChEMBL_1334625 (CHEMBL3239825)
Ki
1.2±n/a nM
Citation
 Han, SThatte, JBuzard, DJJones, RM Therapeutic utility of cannabinoid receptor type 2 (CB(2)) selective agonists. Cell Chem Biol 56:8224-56 (2013)  
Target
Name:
Cannabinoid receptor 1
Synonyms:
Brain-type cannabinoid receptor CB-R CNR1_RAT Cannabinoid receptor Cnr1 | Skr6
Type:
G Protein-Coupled Receptor (GPCR)
Mol. Mass.:
52856.55
Organism:
Rattus norvegicus (rat)
Description:
P20272
Residue:
473
  
Inhibitor
Name:
BDBM50006257
Synonyms:
CHEMBL3233404
Type:
Small organic molecule
Emp. Form.:
C24H36O4
Mol. Mass.:
388.5402
SMILES:
[H][C@@]12CC(OO)=CC[C@@]1([H])C(C)(C)Oc1cc(cc(O)c21)C(C)(C)CCCCCC
: