Target
Sigma non-opioid intracellular receptor 1
Ligand
BDBM50359587
Substrate
Meas. Tech.
ChEMBL_1334705 (CHEMBL3238652)
Ki
10320±n/a nM
Citation
 Mach, RHZeng, CHawkins, WG Thes2 receptor: a novel protein for the imaging and treatment of cancer. J Med Chem 56:7137-60 (2013)  
Target
Name:
Sigma non-opioid intracellular receptor 1
Synonyms:
Aging-associated gene 8 protein SGMR1_HUMAN SIGMAR1 SR31747-binding protein Sigma 1-type opioid receptor Sigma1R | hSigmaR1
Type:
Enzyme Catalytic Domain
Mol. Mass.:
25124.85
Organism:
Homo sapiens (Human)
Description:
Q99720
Residue:
223
  
Inhibitor
Name:
BDBM50359587
Synonyms:
CHEMBL1927694
Type:
Small organic molecule
Emp. Form.:
C23H29N3O6
Mol. Mass.:
443.4929
SMILES:
COc1ccc(C(=O)NCCCCN2CCc3ccc(cc3C2)[N+]([O-])=O)c(OC)c1OC
: