Target
Sigma non-opioid intracellular receptor 1
Ligand
BDBM50006607
Substrate
Meas. Tech.
ChEMBL_1334688 (CHEMBL3238571)
Ki
27±n/a nM
Citation
 Mach, RHZeng, CHawkins, WG Thes2 receptor: a novel protein for the imaging and treatment of cancer. J Med Chem 56:7137-60 (2013)  
Target
Name:
Sigma non-opioid intracellular receptor 1
Synonyms:
Opioid receptor SGMR1_RAT Sigma non-opioid intracellular receptor 1 Sigma-1 | Sigmar1
Type:
Enzyme Catalytic Domain
Mol. Mass.:
25266.54
Organism:
RAT
Description:
Q9R0C9
Residue:
223
  
Inhibitor
Name:
BDBM50006607
Synonyms:
CHEMBL3235465 US9724435, SN-79
Type:
Small organic molecule
Emp. Form.:
C23H26FN3O3
Mol. Mass.:
411.4692
SMILES:
CC(=O)c1ccc2n(CCCCN3CCN(CC3)c3ccc(F)cc3)c(=O)oc2c1
: