Target
Sigma non-opioid intracellular receptor 1
Ligand
BDBM50006610
Substrate
Meas. Tech.
ChEMBL_1334705 (CHEMBL3238652)
Ki
7436±n/a nM
Citation
 Mach, RHZeng, CHawkins, WG Thes2 receptor: a novel protein for the imaging and treatment of cancer. J Med Chem 56:7137-60 (2013)  
Target
Name:
Sigma non-opioid intracellular receptor 1
Synonyms:
Aging-associated gene 8 protein SGMR1_HUMAN SIGMAR1 SR31747-binding protein Sigma 1-type opioid receptor Sigma1R | hSigmaR1
Type:
Enzyme Catalytic Domain
Mol. Mass.:
25124.85
Organism:
Homo sapiens (Human)
Description:
Q99720
Residue:
223
  
Inhibitor
Name:
BDBM50006610
Synonyms:
CHEMBL3235468
Type:
Small organic molecule
Emp. Form.:
C22H21Cl2NO2
Mol. Mass.:
402.314
SMILES:
[H][C@]12C[C@](CCN1C)(CC(=O)\C2=C\c1ccc(Cl)c(Cl)c1)c1cccc(O)c1
: