Target
Neuronal acetylcholine receptor subunit alpha-7
Ligand
BDBM50393251
Substrate
Meas. Tech.
ChEMBL_1335290 (CHEMBL3238714)
Ki
0.240000±n/a nM
Citation
 Gao, YKellar, KJYasuda, RPTran, TXiao, YDannals, RFHorti, AG Derivatives of dibenzothiophene for positron emission tomography imaging ofa7-nicotinic acetylcholine receptors. J Med Chem 56:7574-89 (2013)  
Target
Name:
Neuronal acetylcholine receptor subunit alpha-7
Synonyms:
ACHA7_HUMAN Cholinergic, Nicotinic Alpha7 Neuronal acetylcholine receptor protein alpha-7 subunit Nicotinic acetylcholine receptor alpha-7 (alpha7 nAChR)
Type:
Mol. Mass.:
56448.33
Organism:
Homo sapiens (Human)
Description:
CHRNA7 (NACHRA7)
Residue:
502
  
Inhibitor
Name:
BDBM50393251
Synonyms:
CHEMBL2151569
Type:
Small organic molecule
Emp. Form.:
C19H21N5
Mol. Mass.:
319.4035
SMILES:
CN1CC2CN(CC2C1)c1ccc(nn1)-c1ccc2[nH]ccc2c1
: