Target
Acetylcholinesterase
Ligand
BDBM10512
Substrate
Meas. Tech.
ChEMBL_1335299 (CHEMBL3238723)
IC50
0.250000±n/a nM
Citation
 Rosini, MSimoni, EMilelli, AMinarini, AMelchiorre, C Oxidative stress in Alzheimer's disease: are we connecting the dots? J Med Chem 57:2821-31 (2014)  
Target
Name:
Acetylcholinesterase
Synonyms:
ACES_HUMAN Acetylcholinesterase (AChE) | Acetylcholinesterase (human AChE)
Type:
Enzyme
Mol. Mass.:
67792.70
Organism:
Homo sapiens (Human)
Description:
P22303
Residue:
614
  
Inhibitor
Name:
BDBM10512
Synonyms:
CHEMBL194823 tacrine-lipoic acid hybrid 7
Type:
Small organic molecule
Emp. Form.:
C24H32ClN3OS2
Mol. Mass.:
478.113
SMILES:
Clc1ccc2c(NCCCNC(=O)CCCCC3CCSS3)c3CCCCc3nc2c1
: