Target
Histamine H4 receptor
Ligand
BDBM50006768
Substrate
Meas. Tech.
ChEMBL_1336217 (CHEMBL3241465)
EC50
>10000±n/a nM
Citation
 Savall, BMChavez, FTays, KDunford, PJCowden, JMHack, MDWolin, RLThurmond, RLEdwards, JP Discovery and SAR of 6-alkyl-2,4-diaminopyrimidines as histamine H4 receptor antagonists. J Med Chem 57:2429-39 (2014)  
Target
Name:
Histamine H4 receptor
Synonyms:
AXOR35 GPCR105 HH4R HRH4 Histamine H4 receptor Histamine receptor (H3 and H4) SP9144
Type:
G Protein-Coupled Receptor (GPCR)
Mol. Mass.:
44517.02
Organism:
Homo sapiens (Human)
Description:
Binding assays were using CHO cells stably expressing hH4R receptors.
Residue:
390
  
Inhibitor
Name:
BDBM50006768
Synonyms:
CHEMBL3236578
Type:
Small organic molecule
Emp. Form.:
C12H21N5
Mol. Mass.:
235.3286
SMILES:
CC(C)(C)c1cc(nc(N)n1)N1CC[C@@H](N)C1
: