Target
Epidermal growth factor receptor
Ligand
BDBM5446
Substrate
Meas. Tech.
ChEMBL_1335368 (CHEMBL3238947)
IC50
3.0±n/a nM
Citation
 Ji, XPeng, TZhang, XLi, JYang, WTong, LQu, RJiang, HDing, JXie, HLiu, H Design, synthesis and biological evaluation of novel 6-alkenylamides substituted of 4-anilinothieno[2,3-d]pyrimidines as irreversible epidermal growth factor receptor inhibitors. Bioorg Med Chem 22:2366-78 (2014)  
Target
Name:
Epidermal growth factor receptor
Synonyms:
EGF Receptor Substrate EGFR_HUMAN ERBB1 Epidermal Growth Factor Receptor erbB-1 Epidermal growth factor receptor (EGFR) HER1 Proto-oncogene c-ErbB-1 Tyrosine-Protein Kinase ErbB-1
Type:
Receptor Kinase Domain
Mol. Mass.:
134279.59
Organism:
Homo sapiens (Human)
Description:
P00533
Residue:
1210
  
Inhibitor
Name:
BDBM5446
Synonyms:
CHEMBL553 Erlotinib N-(3-Ethynylphenyl)-6,7-bis(2-methoxyethoxy)-4-quinazolinamine Monohydrochloride OSI-774 US10189853, erlotinib US11524945, Compound Erlotinib US9730934, Erlotinib cid_176870
Type:
Small organic molecule
Emp. Form.:
C22H23N3O4
Mol. Mass.:
393.4357
SMILES:
COCCOc1cc2ncnc(Nc3cccc(c3)C#C)c2cc1OCCOC
: