Target
Ubiquitin carboxyl-terminal hydrolase 21
Ligand
BDBM50007791
Substrate
Meas. Tech.
ChEMBL_1335828 (CHEMBL3239937)
IC50
>31000±n/a nM
Citation
 Báez-Santos, YMBarraza, SJWilson, MWAgius, MPMielech, AMDavis, NMBaker, SCLarsen, SDMesecar, AD X-ray structural and biological evaluation of a series of potent and highly selective inhibitors of human coronavirus papain-like proteases. J Med Chem 57:2393-412 (2014)  
Target
Name:
Ubiquitin carboxyl-terminal hydrolase 21
Synonyms:
Deubiquitinating enzyme 21 USP21 Ubiquitin thioesterase 21 | Ubiquitin-specific-processing protease 21
Type:
PROTEIN
Mol. Mass.:
62692.84
Organism:
Homo sapiens (Human)
Description:
ChEMBL_105198
Residue:
565
  
Inhibitor
Name:
BDBM50007791
Synonyms:
CHEMBL3233815 | med.21724, Compound 168
Type:
Small organic molecule
Emp. Form.:
C25H27FN2O
Mol. Mass.:
390.4931
SMILES:
C[C@@H](N1CCC(CC1)C(=O)NCc1cccc(F)c1)c1cccc2ccccc12
: