Target
Replicase polyprotein 1a
Ligand
BDBM50007792
Substrate
Meas. Tech.
ChEMBL_1335833 (CHEMBL3239942)
IC50
37000±n/a nM
Citation
 Báez-Santos, YMBarraza, SJWilson, MWAgius, MPMielech, AMDavis, NMBaker, SCLarsen, SDMesecar, AD X-ray structural and biological evaluation of a series of potent and highly selective inhibitors of human coronavirus papain-like proteases. J Med Chem 57:2393-412 (2014)  
Target
Name:
Replicase polyprotein 1a
Synonyms:
3C-like proteinase 3CLp Growth factor-like peptide Non-structural protein 1 Non-structural protein 11 Non-structural protein 3 Non-structural protein 6 Non-structural protein 8 ORF1a polyprotein PLP1/PLP2 Peptide HD2 nsp1 nsp11 nsp3 nsp5 nsp7 nsp9 p14 p23 p5 p9 | pp1a
Type:
PROTEIN
Mol. Mass.:
451392.15
Organism:
Human coronavirus NL63
Description:
ChEMBL_108271
Residue:
4060
  
Inhibitor
Name:
BDBM50007792
Synonyms:
CHEMBL3233808
Type:
Small organic molecule
Emp. Form.:
C27H31N3O2
Mol. Mass.:
429.5539
SMILES:
C[C@@H](N1CCC(CC1)C(=O)NCc1ccc(NC(C)=O)cc1)c1cccc2ccccc12
: