Target
Acetylcholinesterase
Ligand
BDBM10592
Substrate
Meas. Tech.
ChEMBL_1335842 (CHEMBL3238626)
IC50
1.1±n/a nM
Citation
 Viayna, ESola, IBartolini, MDe Simone, ATapia-Rojas, CSerrano, FGSabaté, RJuárez-Jiménez, JPérez, BLuque, FJAndrisano, VClos, MVInestrosa, NCMuñoz-Torrero, D Synthesis and multitarget biological profiling of a novel family of rhein derivatives as disease-modifying anti-Alzheimer agents. J Med Chem 57:2549-67 (2014)  
Target
Name:
Acetylcholinesterase
Synonyms:
ACES_HUMAN Acetylcholinesterase (AChE) | Acetylcholinesterase (human AChE)
Type:
Enzyme
Mol. Mass.:
67792.70
Organism:
Homo sapiens (Human)
Description:
P22303
Residue:
614
  
Inhibitor
Name:
BDBM10592
Synonyms:
7-chloro-15-methyl-10-azatetracyclo[11.3.1.0^{2,11}.0^{4,9}]heptadeca-2,4(9),5,7,10,14-hexaen-3-amine Huprine Y.HCl | US9238626, (+/-)-Huprine Y HCl
Type:
Small organic molecule
Emp. Form.:
C17H17ClN2
Mol. Mass.:
284.783
SMILES:
CC1=CC2CC(C1)c1c(C2)nc2cc(Cl)ccc2c1N
: