Target
Acetylcholinesterase
Ligand
BDBM50007801
Substrate
Meas. Tech.
ChEMBL_1335853 (CHEMBL3238637)
Ki
2.7±n/a nM
Citation
 Viayna, ESola, IBartolini, MDe Simone, ATapia-Rojas, CSerrano, FGSabaté, RJuárez-Jiménez, JPérez, BLuque, FJAndrisano, VClos, MVInestrosa, NCMuñoz-Torrero, D Synthesis and multitarget biological profiling of a novel family of rhein derivatives as disease-modifying anti-Alzheimer agents. J Med Chem 57:2549-67 (2014)  
Target
Name:
Acetylcholinesterase
Synonyms:
ACES_HUMAN Acetylcholinesterase (AChE) | Acetylcholinesterase (human AChE)
Type:
Enzyme
Mol. Mass.:
67792.70
Organism:
Homo sapiens (Human)
Description:
P22303
Residue:
614
  
Inhibitor
Name:
BDBM50007801
Synonyms:
CHEMBL3233832
Type:
Small organic molecule
Emp. Form.:
C41H43Cl2N3O5
Mol. Mass.:
728.703
SMILES:
Cl.[H][C@]12Cc3nc4cc(Cl)ccc4c(NCCCCCCCCCNC(=O)c4cc(O)c5C(=O)c6c(O)cccc6C(=O)c5c4)c3[C@]([H])(CC(C)=C1)C2
: