Target
Carboxypeptidase B2
Ligand
BDBM50008270
Substrate
Meas. Tech.
ChEMBL_1339182 (CHEMBL3243345)
IC50
8000±n/a nM
Citation
 Brink, MDahlén, AOlsson, TPolla, MSvensson, T Design and synthesis of conformationally restricted inhibitors of active thrombin activatable fibrinolysis inhibitor (TAFIa). Bioorg Med Chem 22:2261-8 (2014)  
Target
Name:
Carboxypeptidase B2
Synonyms:
CBPB2_HUMAN CPU Carboxypeptidase B2 isoform A Plasma carboxypeptidase B Thrombin-activable fibrinolysis inhibitor | pCPB
Type:
Enzyme
Mol. Mass.:
48432.74
Organism:
Homo sapiens (Human)
Description:
Q96IY4
Residue:
423
  
Inhibitor
Name:
BDBM50008270
Synonyms:
CHEMBL3235131
Type:
Small organic molecule
Emp. Form.:
C11H20N4O2
Mol. Mass.:
240.3021
SMILES:
CCCn1cnc(CC(NCCN)C(O)=O)c1
: