Target
Carboxypeptidase B2
Ligand
BDBM50008273
Substrate
Meas. Tech.
ChEMBL_1339182 (CHEMBL3243345)
IC50
80±n/a nM
Citation
 Brink, MDahlén, AOlsson, TPolla, MSvensson, T Design and synthesis of conformationally restricted inhibitors of active thrombin activatable fibrinolysis inhibitor (TAFIa). Bioorg Med Chem 22:2261-8 (2014)  
Target
Name:
Carboxypeptidase B2
Synonyms:
CBPB2_HUMAN CPU Carboxypeptidase B2 isoform A Plasma carboxypeptidase B Thrombin-activable fibrinolysis inhibitor | pCPB
Type:
Enzyme
Mol. Mass.:
48432.74
Organism:
Homo sapiens (Human)
Description:
Q96IY4
Residue:
423
  
Inhibitor
Name:
BDBM50008273
Synonyms:
CHEMBL3235134
Type:
Small organic molecule
Emp. Form.:
C17H27N3O2
Mol. Mass.:
305.4152
SMILES:
NCCC[C@]1(CCc2c(C1)ncn2C1CCCCC1)C(O)=O
: