Target
Carboxypeptidase B2
Ligand
BDBM50008278
Substrate
Meas. Tech.
ChEMBL_1339189 (CHEMBL3243352)
IC50
66±n/a nM
Citation
 Brink, MDahlén, AOlsson, TPolla, MSvensson, T Design and synthesis of conformationally restricted inhibitors of active thrombin activatable fibrinolysis inhibitor (TAFIa). Bioorg Med Chem 22:2261-8 (2014)  
Target
Name:
Carboxypeptidase B2
Synonyms:
CBPB2_HUMAN CPU Carboxypeptidase B2 isoform A Plasma carboxypeptidase B Thrombin-activable fibrinolysis inhibitor | pCPB
Type:
Enzyme
Mol. Mass.:
48432.74
Organism:
Homo sapiens (Human)
Description:
Q96IY4
Residue:
423
  
Inhibitor
Name:
BDBM50008278
Synonyms:
CHEMBL3235139
Type:
Small organic molecule
Emp. Form.:
C17H21N3O2
Mol. Mass.:
299.3675
SMILES:
NCCC[C@]1(CCn2c(C1)ncc2-c1ccccc1)C(O)=O
: