Target
Broad substrate specificity ATP-binding cassette transporter ABCG2
Ligand
BDBM50009169
Substrate
Meas. Tech.
ChEMBL_1338452 (CHEMBL3240718)
EC50
1800±n/a nM
Citation
 Winter, EDevantier Neuenfeldt, PChiaradia-Delatorre, LDGauthier, CYunes, RANunes, RJCreczynski-Pasa, TBDi Pietro, A Symmetric bis-chalcones as a new type of breast cancer resistance protein inhibitors with a mechanism different from that of chromones. J Med Chem 57:2930-41 (2014)  
Target
Name:
Broad substrate specificity ATP-binding cassette transporter ABCG2
Synonyms:
ABCG2 ABCP ATP-binding cassette sub-family G member 2 ATP-binding cassette, sub-family G, member 2 BCRP1 CDw338 Mitoxantrone resistance-associated protein Urate exporter
Type:
Multi-pass membrane protein; monomer or homodimer; disulfide-linked
Mol. Mass.:
72329.48
Organism:
Homo sapiens (Human)
Description:
Q9UNQ0
Residue:
655
  
Inhibitor
Name:
BDBM50009169
Synonyms:
CHEMBL3238346
Type:
Small organic molecule
Emp. Form.:
C30H30O8
Mol. Mass.:
518.5544
SMILES:
COc1cc(OC)c(C(=O)\C=C\c2ccc(\C=C\C(=O)c3c(OC)cc(OC)cc3OC)cc2)c(OC)c1
: