Target
5-hydroxytryptamine receptor 2A
Ligand
BDBM50009386
Substrate
Meas. Tech.
ChEMBL_1335963 (CHEMBL3239084)
Ki
0.710000±n/a nM
Citation
 Wang, SChen, YZhao, SXu, XLiu, XLiu, BFZhang, G Synthesis and biological evaluation of a series of benzoxazole/benzothiazole-containing 2,3-dihydrobenzo[b][1,4]dioxine derivatives as potential antidepressants. Bioorg Med Chem Lett 24:1766-70 (2014)  
Target
Name:
5-hydroxytryptamine receptor 2A
Synonyms:
5-HT-2A 5-HT2A 5-hydroxytryptamine receptor 2A (5HT2A) Htr2 Serotonin Receptor 2A
Type:
G Protein-Coupled Receptor (GPCR)
Mol. Mass.:
52852.05
Organism:
Rattus norvegicus (rat)
Description:
Rat cortex membranes 5-HT2A receptors.
Residue:
471
  
Inhibitor
Name:
BDBM50009386
Synonyms:
CHEMBL3233867
Type:
Small organic molecule
Emp. Form.:
C31H34N2O4
Mol. Mass.:
498.6127
SMILES:
C(CCN1CCC(CC1)c1nc2ccccc2o1)COCC1Oc2ccccc2OC1c1ccccc1
: