Target
Diacylglycerol O-acyltransferase 1
Ligand
BDBM50009394
Substrate
Meas. Tech.
ChEMBL_1335973 (CHEMBL3239094)
IC50
>5000±n/a nM
Citation
 Zhou, GTing, PCWishart, GZorn, NAslanian, RGLin, MSmith, MWalker, SSCook, JVan Heek, MLachowicz, J Discovery of novel quinoline carboxylic acid series as DGAT1 inhibitors. Bioorg Med Chem Lett 24:1790-4 (2014)  
Target
Name:
Diacylglycerol O-acyltransferase 1
Synonyms:
DGAT1_MOUSE Dgat1 Diacylglycerol O-acyltransferase 1 (DGAT1) | Diglyceride acyltransferase
Type:
Enzyme
Mol. Mass.:
56810.61
Organism:
Mus musculus (mouse)
Description:
In this assay, recombinant mouse DGAT-1 containing an N-terminal His6-epitope tag was produced in the baculovirus expression system.
Residue:
498
  
Inhibitor
Name:
BDBM50009394
Synonyms:
CHEMBL3233875
Type:
Small organic molecule
Emp. Form.:
C28H27N3O3
Mol. Mass.:
453.5323
SMILES:
OC(=O)C[C@H]1CC[C@@H](CC1)c1ccc(cc1)-c1ccc2nc([nH]c2c1)C(=O)Nc1ccccc1
: