Target
Apelin
Ligand
BDBM50009560
Substrate
Meas. Tech.
ChEMBL_1336421 (CHEMBL3242425)
Ki
89±n/a nM
Citation
 Margathe, JFIturrioz, XAlvear-Perez, RMarsol, CRiché, SChabane, HTounsi, NKuhry, MHeissler, DHibert, MLlorens-Cortes, CBonnet, D Structure-activity relationship studies toward the discovery of selective apelin receptor agonists. J Med Chem 57:2908-19 (2014)  
Target
Name:
Apelin
Synonyms:
APEL APJ endogenous ligand Apelin-13 Apelin-31 | Apelin-36
Type:
PROTEIN
Mol. Mass.:
8579.06
Organism:
Homo sapiens (Human)
Description:
ChEMBL_108275
Residue:
77
  
Inhibitor
Name:
BDBM50009560
Synonyms:
CHEMBL3234454
Type:
Small organic molecule
Emp. Form.:
C65H80F9N11O14S3
Mol. Mass.:
1506.577
SMILES:
[O-]C(=O)C(F)(F)F.[O-]C(=O)C(F)(F)F.[O-]C(=O)C(F)(F)F.CCN(CC)c1ccc(cc1)C(=C1C=CC(C=C1)=[N+](CC)CC)c1ccc(cc1S([O-])(=O)=O)S(=O)(=O)NCCCC[C@H](NC(=O)Cc1csc(=[NH2+])n1C)C(=O)N[C@@H](Cc1cn(Cc2ccccc2)c[n+]1C)C(=O)NC1CC[NH+](C)CC1
: