Target
Apelin
Ligand
BDBM50009566
Substrate
Meas. Tech.
ChEMBL_1336421 (CHEMBL3242425)
Ki
970±n/a nM
Citation
 Margathe, JFIturrioz, XAlvear-Perez, RMarsol, CRiché, SChabane, HTounsi, NKuhry, MHeissler, DHibert, MLlorens-Cortes, CBonnet, D Structure-activity relationship studies toward the discovery of selective apelin receptor agonists. J Med Chem 57:2908-19 (2014)  
Target
Name:
Apelin
Synonyms:
APEL APJ endogenous ligand Apelin-13 Apelin-31 | Apelin-36
Type:
PROTEIN
Mol. Mass.:
8579.06
Organism:
Homo sapiens (Human)
Description:
ChEMBL_108275
Residue:
77
  
Inhibitor
Name:
BDBM50009566
Synonyms:
CHEMBL3234457
Type:
Small organic molecule
Emp. Form.:
C56H70N11O10S3
Mol. Mass.:
1153.417
SMILES:
CCN(CC)c1ccc2c(-c3ccc(cc3S([O-])(=O)=O)S(=O)(=O)NCCCC[C@H](NC(=O)Cc3csc(=N)n3C)C(=O)N[C@@H](Cc3cn(Cc4ccccc4)c[n+]3C)C(=O)N[C@@H](C)C(N)=O)c3ccc(cc3oc2c1)=[N+](CC)CC
: