Target
Type-1 angiotensin II receptor
Ligand
BDBM50009575
Substrate
Meas. Tech.
ChEMBL_1336425 (CHEMBL3242429)
Ki
>100000±n/a nM
Citation
 Margathe, JFIturrioz, XAlvear-Perez, RMarsol, CRiché, SChabane, HTounsi, NKuhry, MHeissler, DHibert, MLlorens-Cortes, CBonnet, D Structure-activity relationship studies toward the discovery of selective apelin receptor agonists. J Med Chem 57:2908-19 (2014)  
Target
Name:
Type-1 angiotensin II receptor
Synonyms:
AGTR1 AGTR1B AT1 AT1BR AT2R1B Angiotensin II receptor Type-1 angiotensin II receptor (AT1)
Type:
Protein
Mol. Mass.:
41080.75
Organism:
Homo sapiens (Human)
Description:
P30556
Residue:
359
  
Inhibitor
Name:
BDBM50009575
Synonyms:
CHEMBL3234446
Type:
Small organic molecule
Emp. Form.:
C96H156N34O20S
Mol. Mass.:
2138.547
SMILES:
CSCC[C@H](NC(=O)[C@@H]1CCCN1C(=O)CNC(=O)[C@H](CCCCN)NC(=O)[C@H](Cc1cnc[nH]1)NC(=O)[C@H](CO)NC(=O)[C@H](CC(C)C)NC(=O)[C@H](CCCNC(N)=N)NC(=O)[C@@H]1CCCN1C(=O)[C@H](CCCNC(N)=N)NC(=O)[C@H](CCC(N)=O)NC(=O)[C@H](CCCNC(N)=N)NC(=O)[C@H](CCCNC(N)=N)NC(=O)[C@H](Cc1ccccc1)NC(=O)[C@@H](N)CCCCN)C(=O)N1CCC[C@H]1C(=O)N[C@@H](Cc1ccccc1)C(O)=O
: