Target
Apelin
Ligand
BDBM50009576
Substrate
Meas. Tech.
ChEMBL_1336427 (CHEMBL3242431)
IC50
4300±n/a nM
Citation
 Margathe, JFIturrioz, XAlvear-Perez, RMarsol, CRiché, SChabane, HTounsi, NKuhry, MHeissler, DHibert, MLlorens-Cortes, CBonnet, D Structure-activity relationship studies toward the discovery of selective apelin receptor agonists. J Med Chem 57:2908-19 (2014)  
Target
Name:
Apelin
Synonyms:
APEL_RAT Apel Apelin-28 Apelin-36 | Apln
Type:
PROTEIN
Mol. Mass.:
8687.84
Organism:
Rattus norvegicus
Description:
ChEMBL_108274
Residue:
77
  
Inhibitor
Name:
BDBM50009576
Synonyms:
CHEMBL3234447
Type:
Small organic molecule
Emp. Form.:
C72H104N13O10S3
Mol. Mass.:
1407.871
SMILES:
CCN(CC)c1ccc2c(-c3ccc(cc3S([O-])(=O)=O)S(=O)(=O)NCCCCCCCCCCCCNC(=O)NCCCC[C@H](NC(=O)Cc3csc(=[NH2+])n3C)C(=O)N[C@@H](Cc3cn(Cc4ccccc4)c[n+]3C)C(=O)NC3CC[NH+](C)CC3)c3ccc(cc3oc2c1)=[N+](CC)CC
: