Target
Apelin
Ligand
BDBM50009578
Substrate
Meas. Tech.
ChEMBL_1336421 (CHEMBL3242425)
Ki
3000±n/a nM
Citation
 Margathe, JFIturrioz, XAlvear-Perez, RMarsol, CRiché, SChabane, HTounsi, NKuhry, MHeissler, DHibert, MLlorens-Cortes, CBonnet, D Structure-activity relationship studies toward the discovery of selective apelin receptor agonists. J Med Chem 57:2908-19 (2014)  
Target
Name:
Apelin
Synonyms:
APEL APJ endogenous ligand Apelin-13 Apelin-31 | Apelin-36
Type:
PROTEIN
Mol. Mass.:
8579.06
Organism:
Homo sapiens (Human)
Description:
ChEMBL_108275
Residue:
77
  
Inhibitor
Name:
BDBM50009578
Synonyms:
CHEMBL3234449
Type:
Small organic molecule
Emp. Form.:
C72H103N13O10S3
Mol. Mass.:
1406.863
SMILES:
CCN(CC)c1ccc2c(-c3ccc(cc3S([O-])(=O)=O)S(=O)(=O)NCCCCCCCCCCCCNC(=O)NCCCC[C@H](NC(=O)Cc3csc(=N)n3C)C(=O)N[C@@H](Cc3cn(Cc4ccccc4)c[nH+]3)C(=O)NC3CC[N+](C)(C)CC3)c3ccc(cc3oc2c1)=[N+](CC)CC
: