Target
Potassium voltage-gated channel subfamily H member 2
Ligand
BDBM50009583
Substrate
Meas. Tech.
ChEMBL_1336865 (CHEMBL3241723)
IC50
>13000±n/a nM
Citation
 Cox, JMChu, HDYang, CShen, HCWu, ZBalsells, JCrespo, ABrown, PZamlynny, BWiltsie, JClemas, JGibson, JContino, LLisnock, JZhou, GGarcia-Calvo, MBateman, TXu, LTong, XCrook, MSinclair, P Mineralocorticoid receptor antagonists: identification of heterocyclic amide replacements in the oxazolidinedione series. Bioorg Med Chem Lett 24:1681-4 (2014)  
Target
Name:
Potassium voltage-gated channel subfamily H member 2
Synonyms:
1,3-beta-glucan synthase component GLS2 ERG Eag-related protein 1 Ether-a-go-go-related gene (HERG) Ether-a-go-go-related gene potassium channel 1 Ether-a-go-go-related gene potassium channel 1 (hERG1) Ether-a-go-go-related protein 1 H-ERG KCNH2 Potassium voltage-gated channel subfamily H member 2 (hERG) Voltage-gated potassium channel subunit Kv11.1 hERG Potassium Channel 1 | putative potassium channel subunit
Type:
Multi-pass membrane protein
Mol. Mass.:
126672.65
Organism:
Homo sapiens (Human)
Description:
Q12809
Residue:
1159
  
Inhibitor
Name:
BDBM50009583
Synonyms:
CHEMBL3234858
Type:
Small organic molecule
Emp. Form.:
C28H25N3O6
Mol. Mass.:
499.5146
SMILES:
COc1cc(OC)cc(c1)-c1nnc(o1)[C@@]1(Cc2ccccc2)OC(=O)N([C@H](C)c2ccccc2)C1=O
: