Target
Mineralocorticoid receptor
Ligand
BDBM50009628
Substrate
Meas. Tech.
ChEMBL_1336857 (CHEMBL3241715)
IC50
1320±n/a nM
Citation
 Cox, JMChu, HDYang, CShen, HCWu, ZBalsells, JCrespo, ABrown, PZamlynny, BWiltsie, JClemas, JGibson, JContino, LLisnock, JZhou, GGarcia-Calvo, MBateman, TXu, LTong, XCrook, MSinclair, P Mineralocorticoid receptor antagonists: identification of heterocyclic amide replacements in the oxazolidinedione series. Bioorg Med Chem Lett 24:1681-4 (2014)  
Target
Name:
Mineralocorticoid receptor
Synonyms:
MCR MLR NR3C2 | Nuclear receptor subfamily 3 group C member 2
Type:
Enzyme
Mol. Mass.:
107076.42
Organism:
Homo sapiens (Human)
Description:
P08235
Residue:
984
  
Inhibitor
Name:
BDBM50009628
Synonyms:
CHEMBL3234853
Type:
Small organic molecule
Emp. Form.:
C26H20Cl2N4O3
Mol. Mass.:
507.368
SMILES:
C[C@@H](N1C(=O)O[C@@](Cc2ccccc2)(C1=O)c1nnc([nH]1)-c1ccc(Cl)c(Cl)c1)c1ccccc1
: