Target
Ornithine decarboxylase
Ligand
BDBM50009923
Substrate
Meas. Tech.
ChEMBL_1344641 (CHEMBL3254303)
Ki
1050000±n/a nM
Citation
 Bey, PDanzin, CVan Dorsselaer, VMamont, PJung, MTardif, C Analogues of ornithine as inhibitors of ornithine decarboxylase. New deductions concerning the topography of the enzyme's active site. J Med Chem 21:50-5 (1978)  
Target
Name:
Ornithine decarboxylase
Synonyms:
DCOR_RAT Odc1
Type:
PROTEIN
Mol. Mass.:
51037.04
Organism:
Rattus norvegicus
Description:
ChEMBL_1344641
Residue:
461
  
Inhibitor
Name:
BDBM50009923
Synonyms:
CHEMBL3247534
Type:
Small organic molecule
Emp. Form.:
C6H15ClN2O2
Mol. Mass.:
182.648
SMILES:
Cl.C[C@@](N)(CCCN)C(O)=O
: