Target
Acrosin
Ligand
BDBM50010124
Substrate
Meas. Tech.
ChEMBL_1344334 (CHEMBL3257004)
Ki
260±n/a nM
Citation
 Parrish, RFStraus, JWPaulson, JDPolakoski, KLTidwell, RRGeratz, JDStevens, FM Structure-activity relationships for the inhibition of acrosin by benzamidine derivatives. J Med Chem 21:1132-6 (1979)  
Target
Name:
Acrosin
Synonyms:
53 kDa fucose-binding protein ACRO_PIG Acrosin light chain
Type:
PROTEIN
Mol. Mass.:
45383.66
Organism:
Sus scrofa
Description:
ChEMBL_108297
Residue:
415
  
Inhibitor
Name:
BDBM50010124
Synonyms:
CHEMBL3245412
Type:
Small organic molecule
Emp. Form.:
C22H28I2N4O2
Mol. Mass.:
634.2923
SMILES:
NC(=N)c1ccc(OCCCCCCCCOc2ccc(cc2I)C(N)=N)c(I)c1
: