Target
Acrosin
Ligand
BDBM50010136
Substrate
Meas. Tech.
ChEMBL_1344334 (CHEMBL3257004)
Ki
210±n/a nM
Citation
 Parrish, RFStraus, JWPaulson, JDPolakoski, KLTidwell, RRGeratz, JDStevens, FM Structure-activity relationships for the inhibition of acrosin by benzamidine derivatives. J Med Chem 21:1132-6 (1979)  
Target
Name:
Acrosin
Synonyms:
53 kDa fucose-binding protein ACRO_PIG Acrosin light chain
Type:
PROTEIN
Mol. Mass.:
45383.66
Organism:
Sus scrofa
Description:
ChEMBL_108297
Residue:
415
  
Inhibitor
Name:
BDBM50010136
Synonyms:
CHEMBL3245422
Type:
Small organic molecule
Emp. Form.:
C28H24Br2N4O2
Mol. Mass.:
608.324
SMILES:
NC(=N)c1ccc(OCc2cccc(c2)-c2cccc(COc3ccc(cc3Br)C(N)=N)c2)c(Br)c1
: