Target
Aminopeptidase B
Ligand
BDBM50010201
Substrate
Meas. Tech.
ChEMBL_1344423 (CHEMBL3258373)
IC50
87000±n/a nM
Citation
 Nishizawa, RSaino, TTakita, TSuda, HAoyagi, T Synthesis and structure-activity relationships of bestatin analogues, inhibitors of aminopeptidase B. J Med Chem 20:510-5 (1977)  
Target
Name:
Aminopeptidase B
Synonyms:
AMPB_RAT Arginine aminopeptidase Cytosol aminopeptidase IV | Rnpep
Type:
PROTEIN
Mol. Mass.:
72609.93
Organism:
Rattus norvegicus
Description:
ChEMBL_1344423
Residue:
650
  
Inhibitor
Name:
BDBM50010201
Synonyms:
CHEMBL3251677
Type:
Small organic molecule
Emp. Form.:
C12H16N2O4
Mol. Mass.:
252.2664
SMILES:
N[C@H](Cc1ccccc1)[C@H](O)C(=O)NCC(O)=O
: